Nefunguje TrueCrypt - Failed to load TrueCrypt kernel modul

Linux, Unix, BSD systémy, distribuce, open source

Moderátor: Moderátoři Živě.cz

Odeslat příspěvekod xmms 9. 11. 2007 14:51

Při pokusu o připojení šifrovaného svazku vypíše hlášku:
FATAL: Module truecrypt not found.
Failed to load TrueCrypt kernel module

Tak jsem zkusil kompilovat podle návodu na http://forum.ubuntu.cz/index.php?topic=9485.0;wap2

a tohle je výsledek:
Kód: Vybrat vše
baf:/home/baf/stazeno/truecrypt-4.3a-source-code/Linux # ./build.sh
Checking build requirements...
Building kernel module... /home/baf/stazeno/truecrypt-4.3a-source-code/Linux/Kernel/Dm-target.c: In function ‘dm_truecrypt_init’:
/home/baf/stazeno/truecrypt-4.3a-source-code/Linux/Kernel/Dm-target.c:659: error: too many arguments to function ‘kmem_cache_create’
make[2]: *** [/home/baf/stazeno/truecrypt-4.3a-source-code/Linux/Kernel/Dm-target.o] Error 1
make[1]: *** [_module_/home/baf/stazeno/truecrypt-4.3a-source-code/Linux/Kernel] Error 2
make: *** [truecrypt] Error 2
Error: Failed to build kernel module
baf:/home/baf/stazeno/truecrypt-4.3a-source-code/Linux # uname -a

Linux mujlinux 2.6.23.1-900.ccj57-regular #1 SMP 2007/10/26 14:17:15 UTC x86_64 x86_64 x86_64 GNU/Linux
[/code]

jádro jsem kompiloval tohle
ftp://ftp.kernel.org/pub/linux/kernel/v ... .1.tar.bz2

neví někdo co s tím?
xmms
Junior
Uživatelský avatar

Odeslat příspěvekod duBeN 9. 11. 2007 16:58

Probably caused by the kernel. Truecrypt always takes some time to compile on newer versions. Wait for a new release of truecrypt
duBeN
Junior
Uživatelský avatar

Odeslat příspěvekod xmms 11. 11. 2007 02:07

A nějaké předběžné řešení by nebylo?
Vždycky bude někdo lepší než ty. A krysám se nikdy nevyrovnáš. Nikdy!
xmms
Junior
Uživatelský avatar

Odeslat příspěvekod duBeN 12. 11. 2007 12:27

asi pouzit nejaky starsi kernel, alebo iny program
duBeN
Junior
Uživatelský avatar

Odeslat příspěvekod xmms 13. 11. 2007 13:29

Existuje patch pro Truecrypt a potom se to dá zkompilovat a nainstalovat: http://andika-lives-here.blogspot.com/2 ... 3-rcx.html

Problém je, že to moc nepomůže, protože zase nejde připojit svazek:

Enter password for '/home/baf/stazeno/soubor':
insmod: error inserting '/usr/share/truecrypt/kernel/truecrypt-2.6.23.ko': -1 Unknown symbol in module
FATAL: Error inserting truecrypt (/lib/modules/2.6.23.1-900.ccj57-regular/extra/truecrypt.ko): Unknown symbol in module, or unknown parameter (see dmesg)
Failed to load TrueCrypt kernel module

#dmesg

Kód: Vybrat vše
[ 3292.035182] truecrypt: disagrees about version of symbol dm_put_device
[ 3292.035194] truecrypt: Unknown symbol dm_put_device
[ 3292.035275] truecrypt: disagrees about version of symbol dm_unregister_target
[ 3292.035277] truecrypt: Unknown symbol dm_unregister_target
[ 3292.035340] truecrypt: disagrees about version of symbol dm_register_target
[ 3292.035342] truecrypt: Unknown symbol dm_register_target
[ 3292.035380] truecrypt: disagrees about version of symbol dm_table_get_mode
[ 3292.035382] truecrypt: Unknown symbol dm_table_get_mode
[ 3292.035410] truecrypt: disagrees about version of symbol dm_get_device
[ 3292.035412] truecrypt: Unknown symbol dm_get_device
[ 3292.040689] truecrypt: disagrees about version of symbol dm_put_device
[ 3292.040700] truecrypt: Unknown symbol dm_put_device
[ 3292.040786] truecrypt: disagrees about version of symbol dm_unregister_target
[ 3292.040788] truecrypt: Unknown symbol dm_unregister_target
[ 3292.040851] truecrypt: disagrees about version of symbol dm_register_target
[ 3292.040853] truecrypt: Unknown symbol dm_register_target
[ 3292.040891] truecrypt: disagrees about version of symbol dm_table_get_mode
[ 3292.040893] truecrypt: Unknown symbol dm_table_get_mode
[ 3292.040922] truecrypt: disagrees about version of symbol dm_get_device
[ 3292.040923] truecrypt: Unknown symbol dm_get_device
[ 3292.043818] truecrypt: disagrees about version of symbol dm_put_device
[ 3292.043828] truecrypt: Unknown symbol dm_put_device
[ 3292.043908] truecrypt: disagrees about version of symbol dm_unregister_target
[ 3292.043910] truecrypt: Unknown symbol dm_unregister_target
[ 3292.043973] truecrypt: disagrees about version of symbol dm_register_target
[ 3292.043975] truecrypt: Unknown symbol dm_register_target
[ 3292.044013] truecrypt: disagrees about version of symbol dm_table_get_mode
[ 3292.044015] truecrypt: Unknown symbol dm_table_get_mode
[ 3292.044043] truecrypt: disagrees about version of symbol dm_get_device
[ 3292.044045] truecrypt: Unknown symbol dm_get_device


Nevěděl by někdo, jak dál?
xmms
Junior
Uživatelský avatar


Kdo je online

Uživatelé procházející toto fórum: Žádní registrovaní uživatelé a 0 návštevníků